{"text_format":"1","workbook":"xlsx","n_sheets":4,"sheets":["HKG Instructions","SGP Instructions","Timesheet","Data List"],"not_rendered":{"charts":0,"images":8,"macros":1,"external_links":0,"defined_names":3,"comments":1,"pivot_tables":1},"unopened":[],"bounds":{"document_bytes":16777216,"sheet_cells":100000,"rows_first":2000,"rows_last":500,"rows_between":2000,"halvings":0,"cell_chars":16384,"cell_head_chars":4096},"cells_cut":0,"cells_raw":0,"read":"whole","date_system":"1900"}

{"sheet":"HKG Instructions","index":0,"n_rows":70,"n_cols":10,"rows_kept":70,"cut":false,"hidden":false,"merged":[[9,0,9,3]]}
[]
["Timesheet Instructions"]
[]
["1) Please indicate your name, company that you are currently working under, and select the year (ie. 2018) and month (ie. 05. May) applicable."]
["2) On the days that you have worked, please select either 0.50/1.00 day in \"Regular Work Day\" (Column F)."]
[null,"* If Regular Work Day = 1.00, please leave \"Leave Code\" as blank"]
[null,"* If Regular Work Day = 0.50, please select \"Leave Code\""]
["3) On the days that you did not work, please select 0.00 in \"Regular Work Day\" (Column F) and select \"Leave Code\" (Column G) from the drop down list."]
[]
["* LEAVE CODES"]
["AL        ","Paid Annual Leave",null,null,null,null,null,null,"CL","Compensation Leave"]
["SL           ","Sick Leave",null,null,null,null,null,null,"Core","Core Leave"]
["SH","Statutory Holiday",null,null,null,null,null,null,"ML  ","Maternity Leave"]
["NSH","Non-Statutory Holiday",null,null,null,null,null,null,"PL  ","Paternity Leave"]
["NPL","No Pay Leave",null,null,null,null,null,null,"OTH","Others, need to specify in remarks"]
[]
["4) If you are eligible for OT pay as per your contract and you have worked OT for the particular month, please fill in \"Paid OT hours\" (Column H)."]
["5) For any other specific working schedule arrangement, please indicate in the \"Remarks\""]
["6) Should you wish to highlight anything for payroll, you can write in the space provided \"Notes\""]
["7) Incorrect Input and Incomplete Timesheet will not be accepted, please ensure that there is no Error code."]
[]
[]
[]
[]
[]
[]
[]
[]
[]
[]
[]
[]
["8) Please sign the timesheet and ask your manager (authorised personnel in your company) to sign the timesheet."]
[]
[]
["Examples:"]
[null,"New Starter"]
[null,"Date before Start Date select as \"0\" \"OTH\", and indicate start date as Remarks (e.g. SD: 8th May 2018, as below print screen)"]
[]
[]
{"$rows_left_out":31}
{"sheet":"SGP Instructions","index":1,"n_rows":86,"n_cols":14,"rows_kept":86,"cut":false,"hidden":true,"merged":[[11,10,11,12],[12,1,12,7],[10,0,10,3],[11,13,11,16],[13,10,13,12],[12,13,12,16],[13,13,13,16],[11,1,11,7],[12,10,12,12],[13,1,13,7],[14,1,14,7],[14,10,14,12],[14,13,14,16],[15,1,15,7],[15,10,15,12],[15,13,15,16]]}
[]
["Timesheet Instructions"]
[]
["1) Please indicate your name & company that you are currently working under."]
["2) On the days worked, please select either 0.50/1.00 day in \"Regular Work Day\" (Column F)."]
["    * If Regular Work Day = 1.00, please do not select any \"Leave Code\""]
["    * If Regular Work Day = 0.50, please select \"Leave Code\" from the drop-down option"]
["3) On the days that you did not work, please select 0.00 in \"Regular Work Day\" (Column F) and select \"Leave Code\" (Column G) from the drop-down list;"]
[]
["Please refer to the respective leave codes."]
["* LEAVE CODES"]
["AL        "," Annual Leave",null,null,null,null,null,null,null,null,"NPL",null,null,"No Pay Leave "]
["SL           ","Sick Leave ",null,null,null,null,null,null,null,null,"MTL/ PTL  ",null,null,"Maternity Leave/ Paternity Leave"]
["PH","Public Holiday",null,null,null,null,null,null,null,null,"RES",null,null,"Reservist"]
["CCL","Childcare Leave",null,null,null,null,null,null,null,null,"OTH",null,null,"Others, need to specify in remarks"]
["O.I.L","OFF IN LIEU",null,null,null,null,null,null,null,null,"WE",null,null,"Weekends"]
[]
["4) If you are eligible to claim OT hours (as per your contract) and you have worked OT for the particular month, please indicate on the relevant dates the number of OT hours worked (Column H)."]
["5) Please indicate in the \"Remarks\" section (Column I) if you meet any of the criteria below:"]
["- If you have worked on weekends, please indicate Full Day /Half Day/Leave type (if applicable)"]
["- For those who are entitled to allowance, please indicate the type and amount (ie. Shift Allowance $40)"]
["6) Incorrect and Incomplete Timesheet will not be accepted, please ensure that there are no Error code and red-filled cell."]
[]
[]
[]
[]
[]
[]
[]
[]
[]
[]
[]
["7) Please ask your manager (authorised personnel in your company) to sign the timesheet. Otherwise, please provide us with an email approval."]
[]
["Examples:"]
[null,"1) New Starter"]
[null,"Select \"0\" & \"OTH\" for dates before contract start date and indicate start date under Remarks (e.g. SD: 8th May 2018, as per screenshot below)"]
[]
[]
{"$rows_left_out":47}
{"sheet":"Timesheet","index":2,"n_rows":74,"n_cols":9,"rows_kept":74,"cut":false,"hidden":false,"merged":[[8,3,8,5],[9,3,10,5],[8,8,8,9],[21,8,21,10],[22,8,22,10],[26,8,26,10],[27,8,27,10],[44,8,44,10],[45,8,45,10],[23,8,23,10],[24,8,24,10],[29,8,29,10],[35,8,35,10],[36,8,36,10],[37,8,37,10],[38,8,38,10],[30,8,30,10],[39,8,39,10],[25,8,25,10],[46,8,46,10],[40,8,40,10],[41,8,41,10],[80,1,80,11],[62,8,62,9],[47,8,47,10],[48,8,48,10],[62,3,62,5],[78,1,78,11],[79,1,79,11],[76,3,76,9],[52,7,54,10],[58,8,58,9],[60,3,60,5],[60,8,60,9],[73,3,73,9],[71,3,72,9],[3,6,4,7],[4,1,4,2],[64,7,64,10],[7,3,7,5],[31,8,31,10],[32,8,32,10],[33,8,33,10],[34,8,34,10],[28,8,28,10],[17,8,17,10],[18,8,18,10],[19,8,19,10],[20,8,20,10],[42,8,42,10],[43,8,43,10]]}
[]
[]
[]
[null,null,null,null,null,null,{"$f":"IF($D$8='Data List'!$P$9,\"SGP\",IF($D$8='Data List'!$O$9,\"HKG\",\"\"))","v":""}]
[null,"TIMESHEET"]
[]
[]
[null,null,"Country:","Hong Kong"]
[null,null,"Name (legal name):",null,null,null,null,"  English Name (if any):"]
[]
[null,null,"Client Company:"]
[]
[]
[]
[null,null,"Year","2025"]
[null,null,"Month","January"]
[]
[null,null,"Date","Weekday",null,"Regular Work Days","Leave Code","Paid OT hours\n(if entitled OT pay)","Remarks"]
[null,null,"2025-01-01","Wed",{"$f":"IFERROR(VLOOKUP($C19,'Data List'!$B$19:$G$1480,6,FALSE),0)","v":"SH"}]
[null,null,"2025-01-02","Thu",{"$f":"IFERROR(VLOOKUP($C20,'Data List'!$B$19:$G$1480,6,FALSE),0)","v":"NA"}]
[null,null,"2025-01-03","Fri",{"$f":"IFERROR(VLOOKUP($C21,'Data List'!$B$19:$G$1480,6,FALSE),0)","v":"NA"}]
[null,null,"2025-01-04","Sat",{"$f":"IFERROR(VLOOKUP($C22,'Data List'!$B$19:$G$1480,6,FALSE),0)","v":"WE"}]
[null,null,"2025-01-05","Sun",{"$f":"IFERROR(VLOOKUP($C23,'Data List'!$B$19:$G$1480,6,FALSE),0)","v":"WE"}]
[null,null,"2025-01-06","Mon",{"$f":"IFERROR(VLOOKUP($C24,'Data List'!$B$19:$G$1480,6,FALSE),0)","v":"NA"}]
[null,null,"2025-01-07","Tue",{"$f":"IFERROR(VLOOKUP($C25,'Data List'!$B$19:$G$1480,6,FALSE),0)","v":"NA"}]
[null,null,"2025-01-08","Wed",{"$f":"IFERROR(VLOOKUP($C26,'Data List'!$B$19:$G$1480,6,FALSE),0)","v":"NA"}]
[null,null,"2025-01-09","Thu",{"$f":"IFERROR(VLOOKUP($C27,'Data List'!$B$19:$G$1480,6,FALSE),0)","v":"NA"}]
[null,null,"2025-01-10","Fri",{"$f":"IFERROR(VLOOKUP($C28,'Data List'!$B$19:$G$1480,6,FALSE),0)","v":"NA"}]
[null,null,"2025-01-11","Sat",{"$f":"IFERROR(VLOOKUP($C29,'Data List'!$B$19:$G$1480,6,FALSE),0)","v":"WE"}]
[null,null,"2025-01-12","Sun",{"$f":"IFERROR(VLOOKUP($C30,'Data List'!$B$19:$G$1480,6,FALSE),0)","v":"WE"}]
[null,null,"2025-01-13","Mon",{"$f":"IFERROR(VLOOKUP($C31,'Data List'!$B$19:$G$1480,6,FALSE),0)","v":"NA"}]
[null,null,"2025-01-14","Tue",{"$f":"IFERROR(VLOOKUP($C32,'Data List'!$B$19:$G$1480,6,FALSE),0)","v":"NA"}]
[null,null,"2025-01-15","Wed",{"$f":"IFERROR(VLOOKUP($C33,'Data List'!$B$19:$G$1480,6,FALSE),0)","v":"NA"}]
[null,null,"2025-01-16","Thu",{"$f":"IFERROR(VLOOKUP($C34,'Data List'!$B$19:$G$1480,6,FALSE),0)","v":"NA"}]
[null,null,"2025-01-17","Fri",{"$f":"IFERROR(VLOOKUP($C35,'Data List'!$B$19:$G$1480,6,FALSE),0)","v":"NA"}]
[null,null,"2025-01-18","Sat",{"$f":"IFERROR(VLOOKUP($C36,'Data List'!$B$19:$G$1480,6,FALSE),0)","v":"WE"}]
[null,null,"2025-01-19","Sun",{"$f":"IFERROR(VLOOKUP($C37,'Data List'!$B$19:$G$1480,6,FALSE),0)","v":"WE"}]
[null,null,"2025-01-20","Mon",{"$f":"IFERROR(VLOOKUP($C38,'Data List'!$B$19:$G$1480,6,FALSE),0)","v":"NA"}]
[null,null,"2025-01-21","Tue",{"$f":"IFERROR(VLOOKUP($C39,'Data List'!$B$19:$G$1480,6,FALSE),0)","v":"NA"}]
[null,null,"2025-01-22","Wed",{"$f":"IFERROR(VLOOKUP($C40,'Data List'!$B$19:$G$1480,6,FALSE),0)","v":"NA"}]
{"$rows_left_out":35}
{"sheet":"Data List","index":3,"n_rows":1480,"n_cols":21,"rows_kept":1480,"cut":false,"hidden":true,"merged":[]}
[]
[null,"Hong Kong",null,null,null,null,null,null,null,null,null,null,null,null,"NA",0]
[null,"Nexxus Building 20th Floor, 41 Connaught Road Central, Central, Hong Kong",null,null,null,null,null,null,null,null,null,null,null,null,"PH",0.5,"AFRICA   AUSTRALIA   BELGIUM   BRAZIL   CANADA   CHINA   FRANCE   GERMANY   HONG KONG   INDONESIA   IRELAND   JAPAN   KOREA   LUXEMBOURG   MALAYSIA   MIDDLE EAST"]
[null,"Please email your APPROVED timesheet to Timesheets@RobertWalters.com.hk",null,null,null,null,null,null,null,null,null,null,null,null,"SH",1,"NEW ZEALAND   PHILIPPINES   PORTUGAL   SINGAPORE   SOUTH AFRICA   SPAIN   SWITZERLAND   TAIWAN   THAILAND   THE NETHERLANDS   UNITED KINGDOM   UNITED STATES  VIETNAM"]
[null,"ROBERT WALTERS (HONG KONG) LIMITED        Tel: +852 2103 5300",null,null,null,null,null,null,null,null,null,null,null,null,"NSH"]
[null,"Please try to submit your approved timesheet by the last WORKING day of the month in order to receive your pay on the 5th WORKING day of the next month.",null,null,null,null,null,null,null,null,null,null,null,null,"ERROR"]
[null,null,null,null,null,null,null,null,null,null,null,null,null,null,"WE"]
[]
[null,null,null,null,null,null,null,null,null,null,null,null,null,null,"HKGNA","SGPNA","SGPPH","HKGSH","HKGNSH","HKGWE","SGPWE"]
[null,null,null,null,null,null,null,null,null,null,null,null,null,null,"AL","AL","PH","SH","NSH","WE","WE"]
[null,"Singapore",null,null,null,null,null,null,null,null,null,null,null,null,"SL","SL"]
[null,"6 Battery Road, #22-01, Singapore 049909",null,null,null,null,null,null,null,null,null,null,null,null,"NPL","CCL",null,"Hong Kong"]
[null,"Please email your APPROVED timesheet to SingaporeRWTempPayroll@RobertWalters.com",null,null,null,null,null,null,null,null,null,null,null,null,"CL","NPL",null,"Singapore"]
[null,"ROBERT WALTERS (SINGAPORE) PTE LTD        ROC NO.: 199706961F        EA LICENSE NO.: 03C5451        Tel: +65 6228 0200",null,null,null,null,null,null,null,null,null,null,null,null,"Core","O.I.L"]
[null,"Approved timesheet must be submitted by the last WORKING day of the month in order to receive your pay on the 5th WORKING day of the next month.",null,null,null,null,null,null,null,null,null,null,null,null,"ML","RES"]
[null,null,null,null,null,null,null,null,null,null,null,null,null,null,"PL","MTL/PTL"]
[null,null,null,null,null,null,null,null,null,null,null,null,null,null,"OTH","OTH"]
[]
[null,"Date","Day","Weekday","HK PH/NA","SG PH/NA","HK/SG WD","Error","HK/SG","Month","Year",null,null,null,"Day","WD","Leave","ERROR","WE"]
[null,"2022-01-01",{"$f":"DAY(B20)","v":1},{"$f":"TEXT(B20,\"ddd\")","v":"Sat"},"SH","PH",{"$f":"IF(Timesheet!$D$8='Data List'!$B$2,'Data List'!E20,'Data List'!F20)","v":"SH"},{"$f":"IF(AND(G20=$O$2,Timesheet!$F$48=\"\"),$O$6,Timesheet!$F$48)","v":0},null,{"$f":"TEXT($B20,(\"mmmm\"))","v":"January"},{"$f":"TEXT($B20,(\"yyyy\"))","v":"2022"},null,null,null,1,{"$f":"Timesheet!F19","v":0},{"$f":"Timesheet!G19","v":0},{"$f":"IF(Timesheet!D19=\"\",\"OK\",IF(P20=1,\"OK\",IF(OR(Timesheet!E19='Data List'!$O$3,Timesheet!E19='Data List'!$O$4,Timesheet!E19='Data List'!$O$5,Timesheet!E19='Data List'!$O$7),\"OK\",IF(AND(OR($Q20=0,$P20=0,),OR($P20=0.5,$Q20=0)),$O$6,\"OK\"))))","v":"OK"},{"$f":"IFERROR(Timesheet!E19,\"\")","v":"SH"},{"$f":"$M$22&S20","v":"HKGSH"}]
[null,"2022-01-02",2,"Sun",{"$f":"IF(OR(D21=\"Sat\",D21=\"Sun\"),\"WE\",\"NA\")","v":"WE"},{"$f":"IF(OR($D21=\"Sat\",$D21=\"Sun\"),\"WE\",\"NA\")","v":"WE"},{"$f":"IF(Timesheet!$D$8='Data List'!$B$2,'Data List'!E21,'Data List'!F21)","v":"WE"},{"$f":"IF(AND(G21=$O$2,Timesheet!$F$49=\"\"),$O$6,Timesheet!$F$49)","v":0},null,"January","2022",null,null,null,2,{"$f":"Timesheet!F20","v":0},{"$f":"Timesheet!G20","v":0},{"$f":"IF(Timesheet!D20=\"\",\"OK\",IF(P21=1,\"OK\",IF(OR(Timesheet!E20='Data List'!$O$3,Timesheet!E20='Data List'!$O$4,Timesheet!E20='Data List'!$O$5,Timesheet!E20='Data List'!$O$7),\"OK\",IF(AND(OR($Q21=0,$P21=0,),OR($P21=0.5,$Q21=0)),$O$6,\"OK\"))))","v":"ERROR"},{"$f":"IFERROR(Timesheet!E20,\"\")","v":"NA"},{"$f":"$M$22&S21","v":"HKGNA"}]
[null,"2022-01-03",3,"Mon","NA","NA",{"$f":"IF(Timesheet!$D$8='Data List'!$B$2,'Data List'!E22,'Data List'!F22)","v":"NA"},{"$f":"IF(AND(G22=$O$2,Timesheet!$F$48=\"\"),$O$6,Timesheet!$F$48)","v":"ERROR"},null,"January","2022","Country",{"$f":"IF(Timesheet!D8='Data List'!$B$2,\"HKG\",\"SGP\")","v":"HKG"},null,3,{"$f":"Timesheet!F21","v":0},{"$f":"Timesheet!G21","v":0},{"$f":"IF(Timesheet!D21=\"\",\"OK\",IF(P22=1,\"OK\",IF(OR(Timesheet!E21='Data List'!$O$3,Timesheet!E21='Data List'!$O$4,Timesheet!E21='Data List'!$O$5,Timesheet!E21='Data List'!$O$7),\"OK\",IF(AND(OR($Q22=0,$P22=0,),OR($P22=0.5,$Q22=0)),$O$6,\"OK\"))))","v":"ERROR"},{"$f":"IFERROR(Timesheet!E21,\"\")","v":"NA"},"HKGNA"]
[null,"2022-01-04",4,"Tue","NA","NA",{"$f":"IF(Timesheet!$D$8='Data List'!$B$2,'Data List'!E23,'Data List'!F23)","v":"NA"},{"$f":"IF(AND(G23=$O$2,Timesheet!$F$49=\"\"),$O$6,Timesheet!$F$49)","v":"ERROR"},null,"January","2022",null,null,null,4,{"$f":"Timesheet!F22","v":0},{"$f":"Timesheet!G22","v":0},{"$f":"IF(Timesheet!D22=\"\",\"OK\",IF(P23=1,\"OK\",IF(OR(Timesheet!E22='Data List'!$O$3,Timesheet!E22='Data List'!$O$4,Timesheet!E22='Data List'!$O$5,Timesheet!E22='Data List'!$O$7),\"OK\",IF(AND(OR($Q23=0,$P23=0,),OR($P23=0.5,$Q23=0)),$O$6,\"OK\"))))","v":"OK"},{"$f":"IFERROR(Timesheet!E22,\"\")","v":"WE"},"HKGWE"]
[null,"2022-01-05",5,"Wed","NA","NA",{"$f":"IF(Timesheet!$D$8='Data List'!$B$2,'Data List'!E24,'Data List'!F24)","v":"NA"},{"$f":"IF(AND(G24=$O$2,Timesheet!$F$48=\"\"),$O$6,Timesheet!$F$48)","v":"ERROR"},null,"January","2022","Sum of Regular Work Day",{"$f":"SUMIF(Timesheet!$E$19:$E$49,'Data List'!$O$2,Timesheet!$F$19:$F$49)","v":0},null,5,{"$f":"Timesheet!F23","v":0},{"$f":"Timesheet!G23","v":0},{"$f":"IF(Timesheet!D23=\"\",\"OK\",IF(P24=1,\"OK\",IF(OR(Timesheet!E23='Data List'!$O$3,Timesheet!E23='Data List'!$O$4,Timesheet!E23='Data List'!$O$5,Timesheet!E23='Data List'!$O$7),\"OK\",IF(AND(OR($Q24=0,$P24=0,),OR($P24=0.5,$Q24=0)),$O$6,\"OK\"))))","v":"OK"},{"$f":"IFERROR(Timesheet!E23,\"\")","v":"WE"},"HKGWE"]
[null,"2022-01-06",6,"Thu","NA","NA",{"$f":"IF(Timesheet!$D$8='Data List'!$B$2,'Data List'!E25,'Data List'!F25)","v":"NA"},{"$f":"IF(AND(G25=$O$2,Timesheet!$F$49=\"\"),$O$6,Timesheet!$F$49)","v":"ERROR"},null,"January","2022",null,null,null,6,{"$f":"Timesheet!F24","v":0},{"$f":"Timesheet!G24","v":0},{"$f":"IF(Timesheet!D24=\"\",\"OK\",IF(P25=1,\"OK\",IF(OR(Timesheet!E24='Data List'!$O$3,Timesheet!E24='Data List'!$O$4,Timesheet!E24='Data List'!$O$5,Timesheet!E24='Data List'!$O$7),\"OK\",IF(AND(OR($Q25=0,$P25=0,),OR($P25=0.5,$Q25=0)),$O$6,\"OK\"))))","v":"ERROR"},{"$f":"IFERROR(Timesheet!E24,\"\")","v":"NA"},"HKGNA"]
[null,"2022-01-07",7,"Fri","NA","NA",{"$f":"IF(Timesheet!$D$8='Data List'!$B$2,'Data List'!E26,'Data List'!F26)","v":"NA"},{"$f":"IF(AND(G26=$O$2,Timesheet!$F$48=\"\"),$O$6,Timesheet!$F$48)","v":"ERROR"},null,"January","2022","Countifs for Error Per month",{"$f":"COUNTIF($R$20:$R$50,$O$6)","v":19},null,7,{"$f":"Timesheet!F25","v":0},{"$f":"Timesheet!G25","v":0},{"$f":"IF(Timesheet!D25=\"\",\"OK\",IF(P26=1,\"OK\",IF(OR(Timesheet!E25='Data List'!$O$3,Timesheet!E25='Data List'!$O$4,Timesheet!E25='Data List'!$O$5,Timesheet!E25='Data List'!$O$7),\"OK\",IF(AND(OR($Q26=0,$P26=0,),OR($P26=0.5,$Q26=0)),$O$6,\"OK\"))))","v":"ERROR"},{"$f":"IFERROR(Timesheet!E25,\"\")","v":"NA"},"HKGNA"]
[null,"2022-01-08",8,"Sat","WE","WE",{"$f":"IF(Timesheet!$D$8='Data List'!$B$2,'Data List'!E27,'Data List'!F27)","v":"WE"},{"$f":"IF(AND(G27=$O$2,Timesheet!$F$49=\"\"),$O$6,Timesheet!$F$49)","v":0},null,"January","2022",null,null,null,8,{"$f":"Timesheet!F26","v":0},{"$f":"Timesheet!G26","v":0},{"$f":"IF(Timesheet!D26=\"\",\"OK\",IF(P27=1,\"OK\",IF(OR(Timesheet!E26='Data List'!$O$3,Timesheet!E26='Data List'!$O$4,Timesheet!E26='Data List'!$O$5,Timesheet!E26='Data List'!$O$7),\"OK\",IF(AND(OR($Q27=0,$P27=0,),OR($P27=0.5,$Q27=0)),$O$6,\"OK\"))))","v":"ERROR"},{"$f":"IFERROR(Timesheet!E26,\"\")","v":"NA"},"HKGNA"]
[null,"2022-01-09",9,"Sun","WE","WE",{"$f":"IF(Timesheet!$D$8='Data List'!$B$2,'Data List'!E28,'Data List'!F28)","v":"WE"},{"$f":"IF(AND(G28=$O$2,Timesheet!$F$48=\"\"),$O$6,Timesheet!$F$48)","v":0},null,"January","2022","Total Days Worked:",{"$f":"IF(($M$26>0),$O$6,$M$24)","v":"ERROR"},null,9,{"$f":"Timesheet!F27","v":0},{"$f":"Timesheet!G27","v":0},{"$f":"IF(Timesheet!D27=\"\",\"OK\",IF(P28=1,\"OK\",IF(OR(Timesheet!E27='Data List'!$O$3,Timesheet!E27='Data List'!$O$4,Timesheet!E27='Data List'!$O$5,Timesheet!E27='Data List'!$O$7),\"OK\",IF(AND(OR($Q28=0,$P28=0,),OR($P28=0.5,$Q28=0)),$O$6,\"OK\"))))","v":"ERROR"},{"$f":"IFERROR(Timesheet!E27,\"\")","v":"NA"},"HKGNA"]
[null,"2022-01-10",10,"Mon","NA","NA",{"$f":"IF(Timesheet!$D$8='Data List'!$B$2,'Data List'!E29,'Data List'!F29)","v":"NA"},{"$f":"IF(AND(G29=$O$2,Timesheet!$F$49=\"\"),$O$6,Timesheet!$F$49)","v":"ERROR"},null,"January","2022",null,null,null,10,{"$f":"Timesheet!F28","v":0},{"$f":"Timesheet!G28","v":0},{"$f":"IF(Timesheet!D28=\"\",\"OK\",IF(P29=1,\"OK\",IF(OR(Timesheet!E28='Data List'!$O$3,Timesheet!E28='Data List'!$O$4,Timesheet!E28='Data List'!$O$5,Timesheet!E28='Data List'!$O$7),\"OK\",IF(AND(OR($Q29=0,$P29=0,),OR($P29=0.5,$Q29=0)),$O$6,\"OK\"))))","v":"ERROR"},{"$f":"IFERROR(Timesheet!E28,\"\")","v":"NA"},"HKGNA"]
[null,"2022-01-11",11,"Tue","NA","NA",{"$f":"IF(Timesheet!$D$8='Data List'!$B$2,'Data List'!E30,'Data List'!F30)","v":"NA"},{"$f":"IF(AND(G30=$O$2,Timesheet!$F$48=\"\"),$O$6,Timesheet!$F$48)","v":"ERROR"},null,"January","2022","Sum of Total Paid OT hours:",{"$f":"SUM(Timesheet!$H$19:$H$49)","v":0},null,11,{"$f":"Timesheet!F29","v":0},{"$f":"Timesheet!G29","v":0},{"$f":"IF(Timesheet!D29=\"\",\"OK\",IF(P30=1,\"OK\",IF(OR(Timesheet!E29='Data List'!$O$3,Timesheet!E29='Data List'!$O$4,Timesheet!E29='Data List'!$O$5,Timesheet!E29='Data List'!$O$7),\"OK\",IF(AND(OR($Q30=0,$P30=0,),OR($P30=0.5,$Q30=0)),$O$6,\"OK\"))))","v":"OK"},{"$f":"IFERROR(Timesheet!E29,\"\")","v":"WE"},"HKGWE"]
[null,"2022-01-12",12,"Wed","NA","NA",{"$f":"IF(Timesheet!$D$8='Data List'!$B$2,'Data List'!E31,'Data List'!F31)","v":"NA"},{"$f":"IF(AND(G31=$O$2,Timesheet!$F$49=\"\"),$O$6,Timesheet!$F$49)","v":"ERROR"},null,"January","2022",null,null,null,12,{"$f":"Timesheet!F30","v":0},{"$f":"Timesheet!G30","v":0},{"$f":"IF(Timesheet!D30=\"\",\"OK\",IF(P31=1,\"OK\",IF(OR(Timesheet!E30='Data List'!$O$3,Timesheet!E30='Data List'!$O$4,Timesheet!E30='Data List'!$O$5,Timesheet!E30='Data List'!$O$7),\"OK\",IF(AND(OR($Q31=0,$P31=0,),OR($P31=0.5,$Q31=0)),$O$6,\"OK\"))))","v":"OK"},{"$f":"IFERROR(Timesheet!E30,\"\")","v":"WE"},"HKGWE"]
[null,"2022-01-13",13,"Thu","NA","NA",{"$f":"IF(Timesheet!$D$8='Data List'!$B$2,'Data List'!E32,'Data List'!F32)","v":"NA"},{"$f":"IF(AND(G32=$O$2,Timesheet!$F$48=\"\"),$O$6,Timesheet!$F$48)","v":"ERROR"},null,"January","2022","Total Paid OT hours:",{"$f":"IF($M$30=0,\"\",$M$30)","v":""},"(inclusive of LC input when Work Day is already 1)",13,{"$f":"Timesheet!F31","v":0},{"$f":"Timesheet!G31","v":0},{"$f":"IF(Timesheet!D31=\"\",\"OK\",IF(P32=1,\"OK\",IF(OR(Timesheet!E31='Data List'!$O$3,Timesheet!E31='Data List'!$O$4,Timesheet!E31='Data List'!$O$5,Timesheet!E31='Data List'!$O$7),\"OK\",IF(AND(OR($Q32=0,$P32=0,),OR($P32=0.5,$Q32=0)),$O$6,\"OK\"))))","v":"ERROR"},{"$f":"IFERROR(Timesheet!E31,\"\")","v":"NA"},"HKGNA"]
[null,"2022-01-14",14,"Fri","NA","NA",{"$f":"IF(Timesheet!$D$8='Data List'!$B$2,'Data List'!E33,'Data List'!F33)","v":"NA"},{"$f":"IF(AND(G33=$O$2,Timesheet!$F$49=\"\"),$O$6,Timesheet!$F$49)","v":"ERROR"},null,"January","2022",null,null,null,14,{"$f":"Timesheet!F32","v":0},{"$f":"Timesheet!G32","v":0},{"$f":"IF(Timesheet!D32=\"\",\"OK\",IF(P33=1,\"OK\",IF(OR(Timesheet!E32='Data List'!$O$3,Timesheet!E32='Data List'!$O$4,Timesheet!E32='Data List'!$O$5,Timesheet!E32='Data List'!$O$7),\"OK\",IF(AND(OR($Q33=0,$P33=0,),OR($P33=0.5,$Q33=0)),$O$6,\"OK\"))))","v":"ERROR"},{"$f":"IFERROR(Timesheet!E32,\"\")","v":"NA"},"HKGNA"]
[null,"2022-01-15",15,"Sat","WE","WE",{"$f":"IF(Timesheet!$D$8='Data List'!$B$2,'Data List'!E34,'Data List'!F34)","v":"WE"},{"$f":"IF(AND(G34=$O$2,Timesheet!$F$48=\"\"),$O$6,Timesheet!$F$48)","v":0},null,"January","2022",null,null,null,15,{"$f":"Timesheet!F33","v":0},{"$f":"Timesheet!G33","v":0},{"$f":"IF(Timesheet!D33=\"\",\"OK\",IF(P34=1,\"OK\",IF(OR(Timesheet!E33='Data List'!$O$3,Timesheet!E33='Data List'!$O$4,Timesheet!E33='Data List'!$O$5,Timesheet!E33='Data List'!$O$7),\"OK\",IF(AND(OR($Q34=0,$P34=0,),OR($P34=0.5,$Q34=0)),$O$6,\"OK\"))))","v":"ERROR"},{"$f":"IFERROR(Timesheet!E33,\"\")","v":"NA"},"HKGNA"]
[null,"2022-01-16",16,"Sun","WE","WE",{"$f":"IF(Timesheet!$D$8='Data List'!$B$2,'Data List'!E35,'Data List'!F35)","v":"WE"},{"$f":"IF(AND(G35=$O$2,Timesheet!$F$49=\"\"),$O$6,Timesheet!$F$49)","v":0},null,"January","2022",null,null,null,16,{"$f":"Timesheet!F34","v":0},{"$f":"Timesheet!G34","v":0},{"$f":"IF(Timesheet!D34=\"\",\"OK\",IF(P35=1,\"OK\",IF(OR(Timesheet!E34='Data List'!$O$3,Timesheet!E34='Data List'!$O$4,Timesheet!E34='Data List'!$O$5,Timesheet!E34='Data List'!$O$7),\"OK\",IF(AND(OR($Q35=0,$P35=0,),OR($P35=0.5,$Q35=0)),$O$6,\"OK\"))))","v":"ERROR"},{"$f":"IFERROR(Timesheet!E34,\"\")","v":"NA"},"HKGNA"]
[null,"2022-01-17",17,"Mon","NA","NA",{"$f":"IF(Timesheet!$D$8='Data List'!$B$2,'Data List'!E36,'Data List'!F36)","v":"NA"},{"$f":"IF(AND(G36=$O$2,Timesheet!$F$48=\"\"),$O$6,Timesheet!$F$48)","v":"ERROR"},null,"January","2022",null,null,null,17,{"$f":"Timesheet!F35","v":0},{"$f":"Timesheet!G35","v":0},{"$f":"IF(Timesheet!D35=\"\",\"OK\",IF(P36=1,\"OK\",IF(OR(Timesheet!E35='Data List'!$O$3,Timesheet!E35='Data List'!$O$4,Timesheet!E35='Data List'!$O$5,Timesheet!E35='Data List'!$O$7),\"OK\",IF(AND(OR($Q36=0,$P36=0,),OR($P36=0.5,$Q36=0)),$O$6,\"OK\"))))","v":"ERROR"},{"$f":"IFERROR(Timesheet!E35,\"\")","v":"NA"},"HKGNA"]
[null,"2022-01-18",18,"Tue","NA","NA",{"$f":"IF(Timesheet!$D$8='Data List'!$B$2,'Data List'!E37,'Data List'!F37)","v":"NA"},{"$f":"IF(AND(G37=$O$2,Timesheet!$F$49=\"\"),$O$6,Timesheet!$F$49)","v":"ERROR"},null,"January","2022",null,null,null,18,{"$f":"Timesheet!F36","v":0},{"$f":"Timesheet!G36","v":0},{"$f":"IF(Timesheet!D36=\"\",\"OK\",IF(P37=1,\"OK\",IF(OR(Timesheet!E36='Data List'!$O$3,Timesheet!E36='Data List'!$O$4,Timesheet!E36='Data List'!$O$5,Timesheet!E36='Data List'!$O$7),\"OK\",IF(AND(OR($Q37=0,$P37=0,),OR($P37=0.5,$Q37=0)),$O$6,\"OK\"))))","v":"OK"},{"$f":"IFERROR(Timesheet!E36,\"\")","v":"WE"},"HKGWE"]
[null,"2022-01-19",19,"Wed","NA","NA",{"$f":"IF(Timesheet!$D$8='Data List'!$B$2,'Data List'!E38,'Data List'!F38)","v":"NA"},{"$f":"IF(AND(G38=$O$2,Timesheet!$F$48=\"\"),$O$6,Timesheet!$F$48)","v":"ERROR"},null,"January","2022",null,null,null,19,{"$f":"Timesheet!F37","v":0},{"$f":"Timesheet!G37","v":0},{"$f":"IF(Timesheet!D37=\"\",\"OK\",IF(P38=1,\"OK\",IF(OR(Timesheet!E37='Data List'!$O$3,Timesheet!E37='Data List'!$O$4,Timesheet!E37='Data List'!$O$5,Timesheet!E37='Data List'!$O$7),\"OK\",IF(AND(OR($Q38=0,$P38=0,),OR($P38=0.5,$Q38=0)),$O$6,\"OK\"))))","v":"OK"},{"$f":"IFERROR(Timesheet!E37,\"\")","v":"WE"},"HKGWE"]
[null,"2022-01-20",20,"Thu","NA","NA",{"$f":"IF(Timesheet!$D$8='Data List'!$B$2,'Data List'!E39,'Data List'!F39)","v":"NA"},{"$f":"IF(AND(G39=$O$2,Timesheet!$F$49=\"\"),$O$6,Timesheet!$F$49)","v":"ERROR"},null,"January","2022",null,null,null,20,{"$f":"Timesheet!F38","v":0},{"$f":"Timesheet!G38","v":0},{"$f":"IF(Timesheet!D38=\"\",\"OK\",IF(P39=1,\"OK\",IF(OR(Timesheet!E38='Data List'!$O$3,Timesheet!E38='Data List'!$O$4,Timesheet!E38='Data List'!$O$5,Timesheet!E38='Data List'!$O$7),\"OK\",IF(AND(OR($Q39=0,$P39=0,),OR($P39=0.5,$Q39=0)),$O$6,\"OK\"))))","v":"ERROR"},{"$f":"IFERROR(Timesheet!E38,\"\")","v":"NA"},"HKGNA"]
[null,"2022-01-21",21,"Fri","NA","NA",{"$f":"IF(Timesheet!$D$8='Data List'!$B$2,'Data List'!E40,'Data List'!F40)","v":"NA"},{"$f":"IF(AND(G40=$O$2,Timesheet!$F$48=\"\"),$O$6,Timesheet!$F$48)","v":"ERROR"},null,"January","2022",null,null,null,21,{"$f":"Timesheet!F39","v":0},{"$f":"Timesheet!G39","v":0},{"$f":"IF(Timesheet!D39=\"\",\"OK\",IF(P40=1,\"OK\",IF(OR(Timesheet!E39='Data List'!$O$3,Timesheet!E39='Data List'!$O$4,Timesheet!E39='Data List'!$O$5,Timesheet!E39='Data List'!$O$7),\"OK\",IF(AND(OR($Q40=0,$P40=0,),OR($P40=0.5,$Q40=0)),$O$6,\"OK\"))))","v":"ERROR"},{"$f":"IFERROR(Timesheet!E39,\"\")","v":"NA"},"HKGNA"]
{"$rows_left_out":1440}